BDBM50215302 CHEMBL98057
SMILES Cc1cnc(NCC2(CCC2)c2ccccc2)c(=O)n1CC(=O)NCc1ccc2[nH]nc(O)c2c1
InChI Key InChIKey=YWWHVCWMEXEZFV-UHFFFAOYSA-N
Data  1 KI
  Tab Delimited (TSV)   2D SDfile   Computed 3D by Vconf -m prep SDfile
Find this compound or compounds like it in BindingDB:
Activity Spreadsheet -- Enzyme Inhibition Constant Data from BindingDB
Found 1 hit for monomerid = 50215302
TargetProthrombin(Homo sapiens (Human))
Corvas International
Curated by ChEMBL
LigandPNGBDBM50215302(CHEMBL98057)
Affinity DataKi:  10nM. Assay description: In vitro inhibitory activity against human Thrombin (FIIa) cleavage of the chromogenic substrate
In DepthDetails ArticlePubMed