BDBM50215579 1-((3R,6S)-6-(3-cyanophenyl)bicyclo[4.1.0]heptan-3-yl)-1-(2-(diisopropylamino)ethyl)-3-(3-fluorophenyl)urea::CHEMBL426369
SMILES CC(C)N(CCN([C@@H]1CC[C@@]2(CC2C1)c1cccc(c1)C#N)C(=O)Nc1cccc(F)c1)C(C)C
InChI Key InChIKey=DANZSPBLGVMJBV-SCANVSGJSA-N
Data  2 KI
  Tab Delimited (TSV)   2D SDfile   Computed 3D by Vconf -m prep SDfile
Find this compound or compounds like it in BindingDB:
Activity Spreadsheet -- Enzyme Inhibition Constant Data from BindingDB
Found 2 hits for monomerid = 50215579
TargetMelanin-concentrating hormone receptor 1(Homo sapiens (Human))
Universidad De Cartagena
Curated by ChEMBL
LigandPNGBDBM50215579(1-((3R,6S)-6-(3-cyanophenyl)bicyclo[4.1.0]heptan-3...)
Affinity DataKi:  2.10nM. Assay description: Antagonist activity at MCH1 receptor
In DepthDetails ArticlePubMed
TargetMelanin-concentrating hormone receptor 1(Homo sapiens (Human))
Universidad De Cartagena
Curated by ChEMBL
LigandPNGBDBM50215579(1-((3R,6S)-6-(3-cyanophenyl)bicyclo[4.1.0]heptan-3...)
Affinity DataKi:  2.10nM. Assay description: Displacement of [125I]MCH from MCHR1 expressed in CHO cells
In DepthDetails ArticlePubMed