BDBM50215642 1-((3R,6S)-6-(3-cyanophenyl)bicyclo[4.1.0]heptan-3-yl)-3-(3-fluorophenyl)-1-((1-(methylsulfonyl)piperidin-4-yl)methyl)urea::CHEMBL389058
SMILES CS(=O)(=O)N1CCC(CN([C@@H]2CC[C@@]3(CC3C2)c2cccc(c2)C#N)C(=O)Nc2cccc(F)c2)CC1
InChI Key InChIKey=QMNSATAKKLFUPO-RLWFRMLUSA-N
Data  2 KI
  Tab Delimited (TSV)   2D SDfile   Computed 3D by Vconf -m prep SDfile
Find this compound or compounds like it in BindingDB:
Activity Spreadsheet -- Enzyme Inhibition Constant Data from BindingDB
Found 2 hits for monomerid = 50215642
TargetMelanin-concentrating hormone receptor 1(Homo sapiens (Human))
Schering-Plough Research Institute
Curated by ChEMBL
LigandPNGBDBM50215642(1-((3R,6S)-6-(3-cyanophenyl)bicyclo[4.1.0]heptan-3...)
Affinity DataKi:  9.70nM. Assay description: Displacement of [125I]MCH from MCHR1 expressed in CHO cells
In DepthDetails ArticlePubMed
TargetMelanin-concentrating hormone receptor 1(Homo sapiens (Human))
Schering-Plough Research Institute
Curated by ChEMBL
LigandPNGBDBM50215642(1-((3R,6S)-6-(3-cyanophenyl)bicyclo[4.1.0]heptan-3...)
Affinity DataKi:  9.71nM. Assay description: Antagonist activity at MCH1 receptor
In DepthDetails ArticlePubMed