BDBM50215761 1-(5-((5-((2,2-difluorobenzo[d][1,3]dioxol-5-yl)carbamoyl)thiazol-4-ylamino)methyl)pyridin-2-yl)-3-methylurea::CHEMBL247250
SMILES CNC(=O)Nc1ccc(CNc2ncsc2C(=O)Nc2ccc3OC(F)(F)Oc3c2)cn1
InChI Key InChIKey=APMQKHHNTLVDQD-UHFFFAOYSA-N
Data  5 IC50
  Tab Delimited (TSV)   2D SDfile   Computed 3D by Vconf -m prep SDfile
Find this compound or compounds like it in BindingDB:
Activity Spreadsheet -- Enzyme Inhibition Constant Data from BindingDB
Found 5 hits for monomerid = 50215761
TargetSerine/threonine-protein kinase B-raf(Homo sapiens (Human))
Bayer Research Center
Curated by ChEMBL
LigandPNGBDBM50215761(1-(5-((5-((2,2-difluorobenzo[d][1,3]dioxol-5-yl)ca...)
Affinity DataIC50:  69nM. Assay description: Inhibition of b-Raf
In DepthDetails ArticlePubMed
TargetVascular endothelial growth factor receptor 2(Homo sapiens (Human))
Bayer Research Center
Curated by ChEMBL
LigandPNGBDBM50215761(1-(5-((5-((2,2-difluorobenzo[d][1,3]dioxol-5-yl)ca...)
Affinity DataIC50:  3nM. Assay description: Inhibition of VEGFR2
In DepthDetails ArticlePubMed
TargetSerine/threonine-protein kinase B-raf(Homo sapiens (Human))
Bayer Research Center
Curated by ChEMBL
LigandPNGBDBM50215761(1-(5-((5-((2,2-difluorobenzo[d][1,3]dioxol-5-yl)ca...)
Affinity DataIC50:  508nM. Assay description: Inhibition of P-ERK
In DepthDetails ArticlePubMed
TargetMast/stem cell growth factor receptor Kit(Homo sapiens (Human))
Bayer Research Center
Curated by ChEMBL
LigandPNGBDBM50215761(1-(5-((5-((2,2-difluorobenzo[d][1,3]dioxol-5-yl)ca...)
Affinity DataIC50:  5nM. Assay description: Inhibition of human recombinant cKit by FRET assay
In DepthDetails ArticlePubMed
TargetRAC-alpha serine/threonine-protein kinase(Homo sapiens (Human))
Bayer Research Center
Curated by ChEMBL
LigandPNGBDBM50215761(1-(5-((5-((2,2-difluorobenzo[d][1,3]dioxol-5-yl)ca...)
Affinity DataIC50:  24nM. Assay description: Inhibition of pAkt
In DepthDetails ArticlePubMed