BDBM50215780 4-((2-((2,2-difluorobenzo[d][1,3]dioxol-5-yl)carbamoyl)phenylamino)methyl)-N-(2-methoxyethyl)picolinamide::CHEMBL245805
SMILES COCCNC(=O)c1cc(CNc2ccccc2C(=O)Nc2ccc3OC(F)(F)Oc3c2)ccn1
InChI Key InChIKey=WZERXMDVFBGCAP-UHFFFAOYSA-N
Data  2 IC50
  Tab Delimited (TSV)   2D SDfile   Computed 3D by Vconf -m prep SDfile
Find this compound or compounds like it in BindingDB:
Activity Spreadsheet -- Enzyme Inhibition Constant Data from BindingDB
Found 2 hits for monomerid = 50215780
TargetSerine/threonine-protein kinase B-raf(Homo sapiens (Human))
Bayer Research Center
Curated by ChEMBL
LigandPNGBDBM50215780(4-((2-((2,2-difluorobenzo[d][1,3]dioxol-5-yl)carba...)
Affinity DataIC50:  497nM. Assay description: Inhibition of b-Raf
In DepthDetails ArticlePubMed
TargetMast/stem cell growth factor receptor Kit(Homo sapiens (Human))
Bayer Research Center
Curated by ChEMBL
LigandPNGBDBM50215780(4-((2-((2,2-difluorobenzo[d][1,3]dioxol-5-yl)carba...)
Affinity DataIC50:  38nM. Assay description: Inhibition of human recombinant cKit by FRET assay
In DepthDetails ArticlePubMed