BDBM50215899 CHEMBL250711::N-oleoyl-dopamine::Oleoyl dopamine::cid_5282106
SMILES CCCCCCCC\C=C/CCCCCCCC(=O)NCCc1ccc(O)c(O)c1
InChI Key InChIKey=QQBPLXNESPTPNU-KTKRTIGZSA-N
Data  1 KI  1 IC50  1 EC50
  Tab Delimited (TSV)   2D SDfile   Computed 3D by Vconf -m prep SDfile
Find this compound or compounds like it in BindingDB:
Activity Spreadsheet -- Enzyme Inhibition Constant Data from BindingDB
Found 3 hits for monomerid = 50215899
TargetLethal factor(Bacillus anthracis)
Purdue University
Curated by ChEMBL
LigandPNGBDBM50215899(CHEMBL250711 | N-oleoyl-dopamine | Oleoyl dopamine...)
Affinity DataKi:  3.00E+3nM. Assay description: Inhibition of anthrax lethal factor by FRET assay
In DepthDetails ArticlePubMed
TargetLethal factor(Bacillus anthracis)
Purdue University
Curated by ChEMBL
LigandPNGBDBM50215899(CHEMBL250711 | N-oleoyl-dopamine | Oleoyl dopamine...)
Affinity DataIC50:  1.50E+4nM. Assay description: Inhibition of anthrax lethal factor by FRET assay
In DepthDetails ArticlePubMed
TargetBcl-2-like protein 11(Homo sapiens (Human))
Broad Institute
Curated by PubChem BioAssay
LigandPNGBDBM50215899(CHEMBL250711 | N-oleoyl-dopamine | Oleoyl dopamine...)
Affinity DataEC50:  8.06E+3nM. Assay description: Keywords: apoptosis, BH3 domain, Bcl2-A1, BIM, caspase, cancer Primary Collaborator: Todd Golub, Broad Institute, golub@broadinstitute.org Assay Over...
In DepthDetails PCBioAssay