BDBM50215912 (3R,3aS,4S,4aR,8aS,9aR,E)-4-(2-(5-ethylpyridin-2-yl)vinyl)-3-methyl-decahydronaphtho[2,3-c]furan-1(3H)-one::CHEMBL231938
SMILES CCc1ccc(\C=C\[C@@H]2[C@@H]3[C@@H](C)OC(=O)[C@@H]3C[C@@H]3CCCC[C@@H]23)nc1
InChI Key InChIKey=NODFTCCHDGGLRY-PTRZMELESA-N
Data  1 IC50
  Tab Delimited (TSV)   2D SDfile   Computed 3D by Vconf -m prep SDfile
Find this compound or compounds like it in BindingDB:
Activity Spreadsheet -- Enzyme Inhibition Constant Data from BindingDB
Found 1 hit for monomerid = 50215912
TargetProteinase-activated receptor 1(Homo sapiens (Human))
Schering-Plough Research Institute
Curated by ChEMBL
LigandPNGBDBM50215912((3R,3aS,4S,4aR,8aS,9aR,E)-4-(2-(5-ethylpyridin-2-y...)
Affinity DataIC50:  263nM. Assay description: Displacement of [3H]haTRAP from human PAR1 receptor in platelet membrane
In DepthDetails ArticlePubMed