BDBM50216080 (2S)-N-[(1S)-4-carbamimidamido-1-{[(1S)-1-carbamoyl-2-(1H-indol-3-yl)ethyl]carbamoyl}butyl]-2-{2-[(2S)-2-{[4-(acetamidomethyl)phenyl]formamido}-3-phenylpropanamido]acetamido}-4-methylpentanamide::CHEMBL440431
SMILES CC(C)C[C@H](NC(=O)CNC(=O)[C@H](Cc1ccccc1)NC(=O)c1ccc(CNC(C)=O)cc1)C(=O)N[C@@H](CCCN=C(N)N)C(=O)N[C@@H](Cc1c[nH]c2ccccc12)C(N)=O
InChI Key InChIKey=AUDHYEXWYCFYNQ-BQYLNSIHSA-N
Data  1 EC50
  Tab Delimited (TSV)   2D SDfile   Computed 3D by Vconf -m prep SDfile
Find this compound or compounds like it in BindingDB:
Activity Spreadsheet -- Enzyme Inhibition Constant Data from BindingDB
Found 1 hit for monomerid = 50216080
TargetKiSS-1 receptor(Homo sapiens (Human))
Kyoto University
Curated by ChEMBL
LigandPNGBDBM50216080((2S)-N-[(1S)-4-carbamimidamido-1-{[(1S)-1-carbamoy...)
Affinity DataEC50:  0.990nM. Assay description: Agonist activity at GPR54 expressed in CHO cells assessed as intracellular calcium mobilization
In DepthDetails ArticlePubMed