BDBM50216217 CHEMBL1160562
SMILES Nc1ncnc2n(cnc12)[C@@H]1O[C@H](COP(O)(=O)OP(O)(=O)C(F)(F)CCCC(F)(F)P(O)(O)=O)[C@@H](O)[C@H]1O
InChI Key InChIKey=VWQBAZQMKBHYJA-QYVSTXNMSA-N
Data  1 Kd
  Tab Delimited (TSV)   2D SDfile   Computed 3D by Vconf -m prep SDfile
Find this compound or compounds like it in BindingDB:
Activity Spreadsheet -- Enzyme Inhibition Constant Data from BindingDB
Found 1 hit for monomerid = 50216217
TargetPhosphoglycerate kinase 1/2(Homo sapiens (Human))
University Of Sheffield
Curated by ChEMBL
LigandPNGBDBM50216217(CHEMBL1160562)
Affinity DataKd:  6.00E+3nM. Assay description: Dissociation constant for binding with Phosphoglycerate kinase (PGK) enzyme is evaluated
In DepthDetails ArticlePubMed