BDBM50216283 CHEMBL328733
SMILES COc1ccc(cc1OC)S(=O)(=O)NC1CCc2cc(Cl)ccc12
InChI Key InChIKey=XBGJAWLHZRNMFZ-UHFFFAOYSA-N
Data  1 IC50
  Tab Delimited (TSV)   2D SDfile   Computed 3D by Vconf -m prep SDfile
Find this compound or compounds like it in BindingDB:
Activity Spreadsheet -- Enzyme Inhibition Constant Data from BindingDB
Found 1 hit for monomerid = 50216283
TargetcAMP-specific 3',5'-cyclic phosphodiesterase 4A/4B/4C/4D(Homo sapiens (Human))
Chiroscience
Curated by ChEMBL
LigandPNGBDBM50216283(CHEMBL328733)
Affinity DataIC50:  5.20E+3nM. Assay description: In vitro binding activity towards catalytic site of phosphodiesterase 4
In DepthDetails ArticlePubMed