BDBM50216477 5-(2-bromobenzyl)-6-(4-benzylpiperidin-1-yl)-3-methylpyrimidine-2,4(1H,3H)-dione::CHEMBL230029
SMILES Cn1c(=O)[nH]c(N2CCC(Cc3ccccc3)CC2)c(Cc2ccccc2Br)c1=O
InChI Key InChIKey=JVPOADUPVCMRQB-UHFFFAOYSA-N
Data  2 KI
  Tab Delimited (TSV)   2D SDfile   Computed 3D by Vconf -m prep SDfile
Find this compound or compounds like it in BindingDB:
Activity Spreadsheet -- Enzyme Inhibition Constant Data from BindingDB
Found 2 hits for monomerid = 50216477
TargetGlucocorticoid receptor(Homo sapiens (Human))
Argenta Discovery
Curated by ChEMBL
LigandPNGBDBM50216477(5-(2-bromobenzyl)-6-(4-benzylpiperidin-1-yl)-3-met...)
Affinity DataKi:  33nM. Assay description: Displacement of [3H]dexamethasone from human recombinant GR
In DepthDetails ArticlePubMed
TargetGlucocorticoid receptor(Homo sapiens (Human))
Argenta Discovery
Curated by ChEMBL
LigandPNGBDBM50216477(5-(2-bromobenzyl)-6-(4-benzylpiperidin-1-yl)-3-met...)
Affinity DataKi:  300nM. Assay description: Antagonist activity at human GR
In DepthDetails ArticlePubMed