BDBM50216673 CHEMBL246195::tert-butyl (R)-1-((R)-1-methyl-2-oxo-5-phenyl-2,3-dihydro-1H-benzo[e][1,4]diazepin-3-ylamino)-1-oxo-4-phenylbutan-2-ylcarbamate
SMILES CN1c2ccccc2C(=N[C@@H](NC(=O)[C@@H](CCc2ccccc2)NC(=O)OC(C)(C)C)C1=O)c1ccccc1
InChI Key InChIKey=GASQNNOBMSQSOK-SQHAQQRYSA-N
Data  1 IC50
  Tab Delimited (TSV)   2D SDfile   Computed 3D by Vconf -m prep SDfile
Find this compound or compounds like it in BindingDB:
Activity Spreadsheet -- Enzyme Inhibition Constant Data from BindingDB
Found 1 hit for monomerid = 50216673
TargetSodium channel protein type 9 subunit alpha(Homo sapiens (Human))
Merck Research Laboratories
Curated by ChEMBL
LigandPNGBDBM50216673(CHEMBL246195 | tert-butyl (R)-1-((R)-1-methyl-2-ox...)
Affinity DataIC50:  238nM. Assay description: Blockade of human Nav1.7 by FRET assay
In DepthDetails ArticlePubMed