BDBM50216708 CHEMBL151887
SMILES Cc1cc(cc(c1)C(F)(F)P(O)(O)=O)C(F)(F)P(O)(O)=O
InChI Key InChIKey=TUJSXBBTDAENOW-UHFFFAOYSA-N
Data  1 IC50
  Tab Delimited (TSV)   2D SDfile   Computed 3D by Vconf -m prep SDfile
Find this compound or compounds like it in BindingDB:
Activity Spreadsheet -- Enzyme Inhibition Constant Data from BindingDB
Found 1 hit for monomerid = 50216708
TargetPhosphoglycerate kinase 1(Homo sapiens (Human))
Sheffield University
Curated by ChEMBL
LigandPNGBDBM50216708(CHEMBL151887)
Affinity DataIC50:  880nM. Assay description: Inhibitory activity against 3-phosphoglycerate kinase.
In DepthDetails ArticlePubMed