BDBM50216771 (2S)-2-{[(2S)-1-[(2S)-2-[(2S)-2-{[(2S)-1-[(2S)-4-carbamoyl-2-[(2S)-pyrrolidin-2-ylformamido]butanoyl]pyrrolidin-2-yl]formamido}-4-(2-oxoacetamido)butanamido]-4-methylpentanoyl]pyrrolidin-2-yl]formamido}-3-phenylpropanoic acid::CHEMBL439042
SMILES CC(C)C[C@H](NC(=O)[C@H](CCNC(=O)C=O)NC(=O)[C@@H]1CCCN1C(=O)[C@H](CCC(N)=O)NC(=O)[C@@H]1CCCN1)C(=O)N1CCC[C@H]1C(=O)N[C@@H](Cc1ccccc1)C(O)=O
InChI Key InChIKey=DOPJWRVBBJDPNQ-YYGRSCHNSA-N
Data  1 KI
  Tab Delimited (TSV)   2D SDfile   Computed 3D by Vconf -m prep SDfile
Find this compound or compounds like it in BindingDB:
Activity Spreadsheet -- Enzyme Inhibition Constant Data from BindingDB
Found 1 hit for monomerid = 50216771
TargetProtein-glutamine gamma-glutamyltransferase 2(Homo sapiens (Human))
Stanford University
Curated by ChEMBL
LigandPNGBDBM50216771((2S)-2-{[(2S)-1-[(2S)-2-[(2S)-2-{[(2S)-1-[(2S)-4-c...)
Affinity DataKi:  4.00E+4nM. Assay description: Inhibition of human recombinant TG2
In DepthDetails ArticlePubMed