BDBM50216775 CHEMBL57654
SMILES Brc1ccc(cc1)C(=O)OCn1ccc(=O)[nH]c1=O
InChI Key InChIKey=WMDDVTNHGMPFKD-UHFFFAOYSA-N
Data  1 IC50
  Tab Delimited (TSV)   2D SDfile   Computed 3D by Vconf -m prep SDfile
Find this compound or compounds like it in BindingDB:
Activity Spreadsheet -- Enzyme Inhibition Constant Data from BindingDB
Found 1 hit for monomerid = 50216775
TargetAcetolactate synthase, chloroplastic(Arabidopsis thaliana)
Nankai University
Curated by ChEMBL
LigandPNGBDBM50216775(CHEMBL57654)
Affinity DataIC50:  1.69E+5nM. Assay description: Inhibitory activity against Acetolactate synthase (ALS) enzyme by using the rape-root growth method
In DepthDetails ArticlePubMed