BDBM50216796 (3R)-3-(3-{[acetyl(methyl)amino]methyl}-1,2,4-oxadiazol-5-yl)-6-cyclohexyl-Nhydroxyhexanamide::CHEMBL226777
SMILES CN(Cc1noc(n1)[C@H](CCCC1CCCCC1)CC(=O)NO)C(C)=O
InChI Key InChIKey=WWCNZZQQQBPRHF-OAHLLOKOSA-N
Data  1 IC50
  Tab Delimited (TSV)   2D SDfile   Computed 3D by Vconf -m prep SDfile
Find this compound or compounds like it in BindingDB:
Activity Spreadsheet -- Enzyme Inhibition Constant Data from BindingDB
Found 1 hit for monomerid = 50216796
TargetBone morphogenetic protein 1(Homo sapiens (Human))
Pfizer
Curated by ChEMBL
LigandPNGBDBM50216796((3R)-3-(3-{[acetyl(methyl)amino]methyl}-1,2,4-oxad...)
Affinity DataIC50:  3nM. Assay description: Inhibition of human procollagen C-proteinase expressed in CHO cells
In DepthDetails ArticlePubMed