BDBM50216998 CHEMBL3349356
SMILES OC(=O)C(F)(F)F.OC(=O)C(F)(F)F.COC(=O)[C@H](CCSC)NC(=O)[C@@H]1C[C@@H](CN1C\C=C\C(N)CS)Oc1cccc2CCCCc12
InChI Key InChIKey=USRNYXGTWZNTLS-UXWDUWDLSA-N
Data  1 IC50
  Tab Delimited (TSV)   2D SDfile   Computed 3D by Vconf -m prep SDfile
Find this compound or compounds like it in BindingDB:
Activity Spreadsheet -- Enzyme Inhibition Constant Data from BindingDB
Found 1 hit for monomerid = 50216998
LigandPNGBDBM50216998(CHEMBL3349356)
Affinity DataIC50: >1.00E+4nM. Assay description: Inhibitory concentration against Farnesyltransferase for Farnesylation of H-ras protein InNIH 3T3 cells transformed with activated H-ras
In DepthDetails ArticlePubMed