BDBM50217034 CHEMBL310913
SMILES OCc1csc(c1)-c1cccs1
InChI Key InChIKey=LSOXYVFRNVHVIW-UHFFFAOYSA-N
Data  1 IC50
  Tab Delimited (TSV)   2D SDfile   Computed 3D by Vconf -m prep SDfile
Find this compound or compounds like it in BindingDB:
Activity Spreadsheet -- Enzyme Inhibition Constant Data from BindingDB
Found 1 hit for monomerid = 50217034
TargetProtein kinase C zeta type(Rattus norvegicus)
Purdue University
Curated by ChEMBL
LigandPNGBDBM50217034(CHEMBL310913)
Affinity DataIC50: >1.00E+6nM. Assay description: Inhibition of protein kinase C
In DepthDetails ArticlePubMed