BDBM50217040 CHEMBL73495
SMILES O=Cc1csc(c1)-c1ccc(s1)-c1cccs1
InChI Key InChIKey=IAQDUXQCKAZHSN-UHFFFAOYSA-N
Data  1 IC50
  Tab Delimited (TSV)   2D SDfile   Computed 3D by Vconf -m prep SDfile
Find this compound or compounds like it in BindingDB:
Activity Spreadsheet -- Enzyme Inhibition Constant Data from BindingDB
Found 1 hit for monomerid = 50217040
TargetProtein kinase C zeta type(Rattus norvegicus)
Purdue University
Curated by ChEMBL
LigandPNGBDBM50217040(CHEMBL73495)
Affinity DataIC50:  5.00E+3nM. Assay description: Inhibition of protein kinase C
In DepthDetails ArticlePubMed