BDBM50217269 1,3,6,7-tetrahydroxy-4-(1,1-dimethylallyl)-8-(3-hydroxy-3-methylbutyl)xanthone::CHEMBL397206
SMILES CC(C)(O)CCc1c(O)c(O)cc2oc3c(c(O)cc(O)c3c(=O)c12)C(C)(C)C=C
InChI Key InChIKey=PMIYVWQFMYYOCU-UHFFFAOYSA-N
Data  1 IC50
  Tab Delimited (TSV)   2D SDfile   Computed 3D by Vconf -m prep SDfile
Find this compound or compounds like it in BindingDB:
Activity Spreadsheet -- Enzyme Inhibition Constant Data from BindingDB
Found 1 hit for monomerid = 50217269
TargetAmine oxidase [flavin-containing] A(Mus musculus)
Chungbuk National University
Curated by ChEMBL
LigandPNGBDBM50217269(1,3,6,7-tetrahydroxy-4-(1,1-dimethylallyl)-8-(3-hy...)
Affinity DataIC50: >1.50E+5nM. Assay description: Inhibition at monoamine oxidase in mouse brain
In DepthDetails ArticlePubMed