BDBM50217271 CHEMBL1626903
SMILES [Cl-].[Cl-].C[C@@H](O)[C@@H]1[C@H]2[C@@H](C)C(=C(N2C1=O)C(O)=O)c1ccc2C(=O)c3cc(C[N+]45CC[N+](CCOc6ccccc6)(CC4)CC5)ccc3-c2c1
InChI Key InChIKey=NWXRDDNUMDKBTB-CNONRZPLSA-O
Data  1 IC50
  Tab Delimited (TSV)   2D SDfile   Computed 3D by Vconf -m prep SDfile
Find this compound or compounds like it in BindingDB:
Activity Spreadsheet -- Enzyme Inhibition Constant Data from BindingDB
Found 1 hit for monomerid = 50217271
TargetTransglycosylase(Staphylococcus aureus)
Merck Research Laboratories
Curated by ChEMBL
LigandPNGBDBM50217271(CHEMBL1626903)
Affinity DataIC50:  566nM. Assay description: Binding affinity against PBP2a receptor by competition analysis with [3H]benzylpenicillin using cell membrane fractions from the MRSA COL strain.
In DepthDetails ArticlePubMed