BDBM50217293 CHEMBL1626969
SMILES [Cl-].[Cl-].C[C@@H](O)[C@@H]1[C@H]2[C@@H](C)C(=C(N2C1=O)C(O)=O)c1ccc2C(=O)c3cc(C[N+]45CC[N+](CC(=O)N(C)c6ccccc6)(CC4)CC5)ccc3-c2c1
InChI Key InChIKey=VCQABZASVVSLFT-WWNBUDHCSA-O
Data  1 IC50
  Tab Delimited (TSV)   2D SDfile   Computed 3D by Vconf -m prep SDfile
Find this compound or compounds like it in BindingDB:
Activity Spreadsheet -- Enzyme Inhibition Constant Data from BindingDB
Found 1 hit for monomerid = 50217293
TargetTransglycosylase(Staphylococcus aureus)
Merck Research Laboratories
Curated by ChEMBL
LigandPNGBDBM50217293(CHEMBL1626969)
Affinity DataIC50:  1.22E+3nM. Assay description: Binding affinity against PBP2a receptor by competition analysis with [3H]benzylpenicillin using cell membrane fractions from the MRSA COL strain.
In DepthDetails ArticlePubMed