BDBM50217296 CHEMBL1626967
SMILES [Cl-].[Cl-].C[C@@H](O)[C@@H]1[C@H]2[C@@H](C)C(=C(N2C1=O)C(O)=O)c1ccc2C(=O)c3cc(C[N+]45CC[N+](CC(=O)Nc6ccccc6C(N)=O)(CC4)CC5)ccc3-c2c1
InChI Key InChIKey=JJYHXJKTUCSRRQ-BZSFZXLYSA-P
Data  1 IC50
  Tab Delimited (TSV)   2D SDfile   Computed 3D by Vconf -m prep SDfile
Find this compound or compounds like it in BindingDB:
Activity Spreadsheet -- Enzyme Inhibition Constant Data from BindingDB
Found 1 hit for monomerid = 50217296
TargetTransglycosylase(Staphylococcus aureus)
Merck Research Laboratories
Curated by ChEMBL
LigandPNGBDBM50217296(CHEMBL1626967)
Affinity DataIC50:  1.02E+3nM. Assay description: Binding affinity against PBP2a receptor by competition analysis with [3H]benzylpenicillin using cell membrane fractions from the MRSA COL strain.
In DepthDetails ArticlePubMed