BDBM50217605 4-(4-(6-methylnaphthalen-2-yl)-2-(4-(methylsulfinyl)phenyl)-1H-imidazol-5-yl)pyridine::CHEMBL400840
SMILES Cc1ccc2cc(ccc2c1)-c1[nH]c(nc1-c1ccncc1)-c1ccc(cc1)S(C)=O
InChI Key InChIKey=MWPCXKSKKQISMH-UHFFFAOYSA-N
Data  1 IC50
  Tab Delimited (TSV)   2D SDfile   Computed 3D by Vconf -m prep SDfile
Find this compound or compounds like it in BindingDB:
Activity Spreadsheet -- Enzyme Inhibition Constant Data from BindingDB
Found 1 hit for monomerid = 50217605
TargetAngiopoietin-1 receptor(Homo sapiens (Human))
Glaxosmithkline
Curated by ChEMBL
LigandPNGBDBM50217605(4-(4-(6-methylnaphthalen-2-yl)-2-(4-(methylsulfiny...)
Affinity DataIC50:  219nM. Assay description: Inhibition of Tie2 kinase by autophosphorylation assay
In DepthDetails ArticlePubMed