BDBM50217845 CHEMBL324327
SMILES [H][C@]1(C\C=C(/C)\C=C\[C@H](O)[C@@H](C)\C=C\C(O)=O)O[C@]2(CC[C@@H]1C)CC[C@@](CCCC)(OC(=O)CCC(=O)OC)[C@@]([H])(O2)\C=C\C=C\C(=O)OC
InChI Key InChIKey=IYTKFWDGMFAIRV-CUJFRHNVSA-N
Data  1 IC50
  Tab Delimited (TSV)   2D SDfile   Computed 3D by Vconf -m prep SDfile
Find this compound or compounds like it in BindingDB:
Activity Spreadsheet -- Enzyme Inhibition Constant Data from BindingDB
Found 1 hit for monomerid = 50217845
TargetIsoleucyl-tRNA synthetase(Rattus norvegicus)
Riken (The Institute Of Physical And Chemical Research)
Curated by ChEMBL
LigandPNGBDBM50217845(CHEMBL324327)
Affinity DataIC50: <1.48E+3nM. Assay description: Inhibitory concentration against Isoleucyl-tRNA synthetase (IleRS) activity
In DepthDetails ArticlePubMed