BDBM50217874 1-(methylnitroso)-6-[2-(morpholin-4-yl)ethoxy]-3-phenyl-N-(propan-2-yl)-1H-indene-2-carboxamide::CHEMBL398424
SMILES CC(C)NC(=O)c1c(-c2ccccc2)c2ccc(OCCN3CCOCC3)cc2[c-]1[N+](C)=O
InChI Key InChIKey=PABDRXDANVHXTC-AZPGRJICSA-N
Data  1 EC50
  Tab Delimited (TSV)   2D SDfile   Computed 3D by Vconf -m prep SDfile
Find this compound or compounds like it in BindingDB:
Activity Spreadsheet -- Enzyme Inhibition Constant Data from BindingDB
Found 1 hit for monomerid = 50217874
TargetPeroxisome proliferator-activated receptor gamma(Homo sapiens (Human))
Korea Research Institute Of Chemical Technology
Curated by ChEMBL
LigandPNGBDBM50217874(1-(methylnitroso)-6-[2-(morpholin-4-yl)ethoxy]-3-p...)
Affinity DataEC50:  200nM. Assay description: Agonist activity at human PPARgamma expressed in NIH3T3 cells by GAL4 transactivation assay
In DepthDetails ArticlePubMed