BDBM50217876 CHEMBL399847::ethyl 1-(methylnitroso)-3-phenyl-6-[2-(pyridin-2-yl)ethoxy]-1H-indene-2-carboxylate
SMILES CCOC(=O)c1c(-c2ccccc2)c2ccc(OCCc3ccccn3)cc2[c-]1[N+](C)=O
InChI Key InChIKey=ZLSVJOBNLADCBL-AZPGRJICSA-N
Data  1 EC50
  Tab Delimited (TSV)   2D SDfile   Computed 3D by Vconf -m prep SDfile
Find this compound or compounds like it in BindingDB:
Activity Spreadsheet -- Enzyme Inhibition Constant Data from BindingDB
Found 1 hit for monomerid = 50217876
TargetPeroxisome proliferator-activated receptor gamma(Homo sapiens (Human))
Korea Research Institute Of Chemical Technology
Curated by ChEMBL
LigandPNGBDBM50217876(CHEMBL399847 | ethyl 1-(methylnitroso)-3-phenyl-6-...)
Affinity DataEC50:  30nM. Assay description: Agonist activity at human PPARgamma expressed in NIH3T3 cells by GAL4 transactivation assay
In DepthDetails ArticlePubMed