BDBM50217891 3-(3-bromo-benzenesulfonyl)-1-(1-methyl-pyrrolidin-3-yl)-1H-pyrrolo[2,3-b]pyridine::CHEMBL236336
SMILES CN1CCC(C1)n1cc(c2cccnc12)S(=O)(=O)c1cccc(Br)c1
InChI Key InChIKey=AZMWVAJCQCQPGQ-UHFFFAOYSA-N
Data  2 KI  1 IC50
  Tab Delimited (TSV)   2D SDfile   Computed 3D by Vconf -m prep SDfile
Find this compound or compounds like it in BindingDB:
Activity Spreadsheet -- Enzyme Inhibition Constant Data from BindingDB
Found 3 hits for monomerid = 50217891
Target5-hydroxytryptamine receptor 6(Homo sapiens (Human))
Islamic Azad University
Curated by ChEMBL
LigandPNGBDBM50217891(3-(3-bromo-benzenesulfonyl)-1-(1-methyl-pyrrolidin...)
Affinity DataKi:  0.891nM. Assay description: Binding affinity to 5HT6 receptor
In DepthDetails ArticlePubMed
Target5-hydroxytryptamine receptor 6(Homo sapiens (Human))
Islamic Azad University
Curated by ChEMBL
LigandPNGBDBM50217891(3-(3-bromo-benzenesulfonyl)-1-(1-methyl-pyrrolidin...)
Affinity DataKi:  0.900nM. Assay description: Displacement of [3H]LSD from cloned human 5HT6 expressed in HeLa cells
In DepthDetails ArticlePubMed
Target5-hydroxytryptamine receptor 6(Homo sapiens (Human))
Islamic Azad University
Curated by ChEMBL
LigandPNGBDBM50217891(3-(3-bromo-benzenesulfonyl)-1-(1-methyl-pyrrolidin...)
Affinity DataIC50:  23nM. Assay description: Antagonist activity at human 5HT6 expressed in HeLa cells assessed as intracellular cAMP level by radioimmunoassay
In DepthDetails ArticlePubMed