BDBM50218346 CHEMBL394010::N1-[5-(6,7-diphenyl-5H-[1,2,4]triazolo[3,4-b][1,3,4]-thiadiazin-3-yl)-4-methyl-2-thienyl]-acetamide
SMILES CC(=O)Nc1cc(C)c(s1)-c1nnc2SC(C(=Nn12)c1ccccc1)c1ccccc1
InChI Key InChIKey=RUEPRKUATJOZMT-UHFFFAOYSA-N
Data  1 IC50
  Tab Delimited (TSV)   2D SDfile   Computed 3D by Vconf -m prep SDfile
Find this compound or compounds like it in BindingDB:
Activity Spreadsheet -- Enzyme Inhibition Constant Data from BindingDB
Found 1 hit for monomerid = 50218346
TargetCyclin-dependent kinase 5 activator 1(Homo sapiens (Human))
Dr. Reddy'S Laboratories
Curated by ChEMBL
LigandPNGBDBM50218346(CHEMBL394010 | N1-[5-(6,7-diphenyl-5H-[1,2,4]triaz...)
Affinity DataIC50:  44nM. Assay description: Inhibitory activity against Cdk5/p25
In DepthDetails ArticlePubMed