BDBM50218665 SANGLIFEHRIN A
SMILES [H][C@@]12CCCN(N1)C(=O)[C@H](Cc1cccc(O)c1)NC(=O)[C@@H](NC(=O)[C@H](CCC(C)=O)[C@H](O)[C@@H](C)[C@@H](O)\C=C\C=C\C[C@H](OC2=O)C(\C)=C\C=C\CC[C@H](C)[C@@H](O)C[C@@H]1O[C@@]2(NC(=O)[C@@H](CC)C[C@@H]2C)[C@@H](C)[C@@H](O)[C@H]1C)C(C)C
InChI Key InChIKey=ONJZYZYZIKTIEG-CFBQITSMSA-N
Data  1 Kd
PDB links: 1 PDB ID matches this monomer.
  Tab Delimited (TSV)   2D SDfile   Computed 3D by Vconf -m prep SDfile
Find this compound or compounds like it in BindingDB:
Activity Spreadsheet -- Enzyme Inhibition Constant Data from BindingDB
Found 1 hit for monomerid = 50218665
TargetPeptidyl-prolyl cis-trans isomerase A(Homo sapiens (Human))
Gilead Sciences
Curated by ChEMBL
LigandPNGBDBM50218665(SANGLIFEHRIN A)
Affinity DataKd:  3.30nM. Assay description: Inhibition of Cy5-labeled cyclosporin A binding to full length recombinant human N-terminal His8-tagged Cyclophilin A (1 to 169 residues) expressed i...