BDBM50218844 CHEMBL313317
SMILES COc1cccc2c1C(=O)C=CC21OCCCO1
InChI Key InChIKey=BDLYXQXOWSONAU-UHFFFAOYSA-N
Data  2 IC50
  Tab Delimited (TSV)   2D SDfile   Computed 3D by Vconf -m prep SDfile
Find this compound or compounds like it in BindingDB:
Activity Spreadsheet -- Enzyme Inhibition Constant Data from BindingDB
Found 2 hits for monomerid = 50218844
TargetThioredoxin reductase 3(Homo sapiens (Human))
University Of Pittsburgh
Curated by ChEMBL
LigandPNGBDBM50218844(CHEMBL313317)
Affinity DataIC50:  4.02E+4nM. Assay description: Inhibition of thioredoxin-1/thioredoxin reductase system
In DepthDetails ArticlePubMed
TargetThioredoxin reductase 3(Homo sapiens (Human))
University Of Pittsburgh
Curated by ChEMBL
LigandPNGBDBM50218844(CHEMBL313317)
Affinity DataIC50:  5.00E+4nM. Assay description: Inhibition of thioredoxin reductase
In DepthDetails ArticlePubMed