BDBM50218966 CHEMBL44878
SMILES CC1(C)OC(=C(C1=O)c1cc(F)ccc1F)c1ccc(cc1)S(C)(=O)=O
InChI Key InChIKey=DLRYQFMDJGUYJO-UHFFFAOYSA-N
Data  2 IC50
  Tab Delimited (TSV)   2D SDfile   Computed 3D by Vconf -m prep SDfile
Find this compound or compounds like it in BindingDB:
Activity Spreadsheet -- Enzyme Inhibition Constant Data from BindingDB
Found 2 hits for monomerid = 50218966
TargetProstaglandin G/H synthase 1(Mus musculus)
Pacific Corporation R & D Center
Curated by ChEMBL
LigandPNGBDBM50218966(CHEMBL44878)
Affinity DataIC50:  5.28E+4nM. Assay description: Ability to inhibit Prostaglandin G/H synthase 1 by using freshly harvested mouse peritoneal macrophages
In DepthDetails ArticlePubMed
TargetProstaglandin G/H synthase 2(Mus musculus (Mouse))
Pacific Corporation R & D Center
Curated by ChEMBL
LigandPNGBDBM50218966(CHEMBL44878)
Affinity DataIC50:  79.3nM. Assay description: Ability to inhibit Prostaglandin G/H synthase 2 by using freshly harvested mouse peritoneal macrophages
In DepthDetails ArticlePubMed