BDBM50218967 CHEMBL297750
SMILES CC(C)c1ccc(cc1)C1=C(OC(C)(C)C1=O)c1ccc(cc1)S(C)(=O)=O
InChI Key InChIKey=LTTCEYOXUCTMBO-UHFFFAOYSA-N
Data  4 IC50
  Tab Delimited (TSV)   2D SDfile   Computed 3D by Vconf -m prep SDfile
Find this compound or compounds like it in BindingDB:
Activity Spreadsheet -- Enzyme Inhibition Constant Data from BindingDB
Found 4 hits for monomerid = 50218967
TargetProstaglandin G/H synthase 1(Mus musculus)
Pacific Corporation R & D Center
Curated by ChEMBL
LigandPNGBDBM50218967(CHEMBL297750)
Affinity DataIC50:  7.80E+3nM. Assay description: Ability to inhibit Prostaglandin G/H synthase 1 by using freshly harvested mouse peritoneal macrophages
In DepthDetails ArticlePubMed
TargetProstaglandin G/H synthase 1(Mus musculus)
Pacific Corporation R & D Center
Curated by ChEMBL
LigandPNGBDBM50218967(CHEMBL297750)
Affinity DataIC50:  7.80E+3nM. Assay description: In vitro inhibitory activity against prostaglandin G/H synthase 1 using mouse peritoneal macrophage method
In DepthDetails ArticlePubMed
TargetProstaglandin G/H synthase 2(Mus musculus (Mouse))
Amorepacific R&D Center
Curated by ChEMBL
LigandPNGBDBM50218967(CHEMBL297750)
Affinity DataIC50:  78nM. Assay description: In vitro inhibitory activity against prostaglandin G/H synthase 2 using mouse peritoneal macrophage method
In DepthDetails ArticlePubMed
TargetProstaglandin G/H synthase 2(Mus musculus (Mouse))
Amorepacific R&D Center
Curated by ChEMBL
LigandPNGBDBM50218967(CHEMBL297750)
Affinity DataIC50:  78nM. Assay description: Ability to inhibit Prostaglandin G/H synthase 2 by using freshly harvested mouse peritoneal macrophages
In DepthDetails ArticlePubMed