BDBM50219003 CHEMBL66860
SMILES Fc1ccc(\C=N\Nc2ncnc3n(ncc23)-c2cccc3[nH]cnc23)cc1
InChI Key InChIKey=ZFIMJZNGNMRTHA-ZNLRHDTNSA-N
Data  1 IC50  1 EC50
  Tab Delimited (TSV)   2D SDfile   Computed 3D by Vconf -m prep SDfile
Find this compound or compounds like it in BindingDB:
Activity Spreadsheet -- Enzyme Inhibition Constant Data from BindingDB
Found 2 hits for monomerid = 50219003
TargetGlycogen synthase kinase-3(Homo sapiens (Human))
Glaxosmithkline
Curated by ChEMBL
LigandPNGBDBM50219003(CHEMBL66860)
Affinity DataIC50:  6.30nM. Assay description: Inhibition of glycogen synthase kinase-3 (GSK3-beta)
In DepthDetails ArticlePubMed
TargetGlycogen synthase kinase-3(Homo sapiens (Human))
Glaxosmithkline
Curated by ChEMBL
LigandPNGBDBM50219003(CHEMBL66860)
Affinity DataEC50:  230nM. Assay description: Inhibition of glycogen synthesis in rat skeletal muscle L6 cells
In DepthDetails ArticlePubMed