BDBM50219040 CHEMBL429464::N-{3-[1-(3-{[bis(4-fluorophenyl)acetyl]amino}propyl)-4-piperidinyl]-4-methylphenyl}-2-methylpropanamide
SMILES CC(C)C(=O)Nc1ccc(C)c(c1)C1CCN(CCCNC(=O)C(c2ccc(F)cc2)c2ccc(F)cc2)CC1
InChI Key InChIKey=OJVUOPKFXPMGGA-UHFFFAOYSA-N
Data  1 KI  1 IC50
  Tab Delimited (TSV)   2D SDfile   Computed 3D by Vconf -m prep SDfile
Find this compound or compounds like it in BindingDB:
Activity Spreadsheet -- Enzyme Inhibition Constant Data from BindingDB
Found 2 hits for monomerid = 50219040
TargetMelanin-concentrating hormone receptor 1(RAT)
Lundbeck Research Usa
Curated by ChEMBL
LigandPNGBDBM50219040(CHEMBL429464 | N-{3-[1-(3-{[bis(4-fluorophenyl)ace...)
Affinity DataKi:  0.620nM. Assay description: Displacement of [3H]SNAP 7941 from rat MCHR1 expressed in HEK293 cells
In DepthDetails ArticlePubMed
TargetMelanin-concentrating hormone receptor 1(RAT)
Lundbeck Research Usa
Curated by ChEMBL
LigandPNGBDBM50219040(CHEMBL429464 | N-{3-[1-(3-{[bis(4-fluorophenyl)ace...)
Affinity DataIC50:  27nM. Assay description: Antagonist activity at rat MCHR1 expressed in HEK293 cells assessed as effect on calcium mobilization
In DepthDetails ArticlePubMed