BDBM50219100 CHEMBL95878
SMILES Ic1ccc(cc1)S(=O)(=O)Nc1ccc2nccc(N3CCNCC3)c2c1
InChI Key InChIKey=HGFSZXHKJHVCNO-UHFFFAOYSA-N
Data  1 KI
  Tab Delimited (TSV)   2D SDfile   Computed 3D by Vconf -m prep SDfile
Find this compound or compounds like it in BindingDB:
Activity Spreadsheet -- Enzyme Inhibition Constant Data from BindingDB
Found 1 hit for monomerid = 50219100
Target5-hydroxytryptamine receptor 6(Homo sapiens (Human))
Glaxosmithkline
Curated by ChEMBL
LigandPNGBDBM50219100(CHEMBL95878)
Affinity DataKi:  1.60nM. Assay description: Binding affinity against human 5-hydroxytryptamine 6 receptor
In DepthDetails ArticlePubMed