BDBM50219192 CHEMBL156742
SMILES CCOC(=O)c1cnc2n(C)c(=O)n(Cc3ccccc3)c(=O)c2c1
InChI Key InChIKey=JUOBVXRRAOMWEM-UHFFFAOYSA-N
Data  1 IC50
  Tab Delimited (TSV)   2D SDfile   Computed 3D by Vconf -m prep SDfile
Find this compound or compounds like it in BindingDB:
Activity Spreadsheet -- Enzyme Inhibition Constant Data from BindingDB
Found 1 hit for monomerid = 50219192
TargetcAMP-specific 3',5'-cyclic phosphodiesterase 4C(Rattus norvegicus)
Korea Institute Of Science And Technology
Curated by ChEMBL
LigandPNGBDBM50219192(CHEMBL156742)
Affinity DataIC50: >1.00E+4nM. Assay description: Concentration for inhibitory activity against phosphodiesterase 4 from rat liver
In DepthDetails ArticlePubMed