BDBM50219503 2-hydroxyphenethyl 3,4,5-trihydroxybenzoate::CHEMBL399354
SMILES Oc1ccccc1CCOC(=O)c1cc(O)c(O)c(O)c1
InChI Key InChIKey=BFCLPURLRKZMCC-UHFFFAOYSA-N
Data  1 IC50
  Tab Delimited (TSV)   2D SDfile   Computed 3D by Vconf -m prep SDfile
Find this compound or compounds like it in BindingDB:
Activity Spreadsheet -- Enzyme Inhibition Constant Data from BindingDB
Found 1 hit for monomerid = 50219503
TargetTyrosinase(Homo sapiens (Human))
Amorepacific
Curated by ChEMBL
LigandPNGBDBM50219503(2-hydroxyphenethyl 3,4,5-trihydroxybenzoate | CHEM...)
Affinity DataIC50:  1.45E+4nM. Assay description: Inhibition of tyrosinase in Melan-a cells
In DepthDetails ArticlePubMed