BDBM50219530 CHEMBL31213
SMILES CN(Cc1cc2cc(ccc2o1)C(=O)N1CCC(CC1)N1C(=O)OCc2ccccc12)C(=O)CN1C(=O)CNC1=O
InChI Key InChIKey=SEYQKZZQMCJGNS-UHFFFAOYSA-N
Data  1 KI
  Tab Delimited (TSV)   2D SDfile   Computed 3D by Vconf -m prep SDfile
Find this compound or compounds like it in BindingDB:
Activity Spreadsheet -- Enzyme Inhibition Constant Data from BindingDB
Found 1 hit for monomerid = 50219530
TargetOxytocin receptor(Homo sapiens (Human))
Glaxosmithkline
Curated by ChEMBL
LigandPNGBDBM50219530(CHEMBL31213)
Affinity DataKi:  25nM. Assay description: Ability to displace [3H]oxytocin from human OT receptor (hOT)
In DepthDetails ArticlePubMed