BDBM50219537 (R)-3-benzyl-4-(2,2,2-trifluoroethyl)-10-(trifluoromethyl)-3,4-dihydro-2H-[1,4]oxazino[2,3-f]quinolin-8(7H)-one::CHEMBL247995
SMILES FC(F)(F)CN1[C@H](Cc2ccccc2)COc2c1ccc1[nH]c(=O)cc(c21)C(F)(F)F
InChI Key InChIKey=OZCWLRIIYUZOSU-CYBMUJFWSA-N
Data  1 IC50  1 EC50
  Tab Delimited (TSV)   2D SDfile   Computed 3D by Vconf -m prep SDfile
Find this compound or compounds like it in BindingDB:
Activity Spreadsheet -- Enzyme Inhibition Constant Data from BindingDB
Found 2 hits for monomerid = 50219537
TargetAndrogen receptor(Homo sapiens (Human))
Ligand Pharmaceuticals
Curated by ChEMBL
LigandPNGBDBM50219537((R)-3-benzyl-4-(2,2,2-trifluoroethyl)-10-(trifluor...)
Affinity DataEC50:  43nM. Assay description: Agonist activity at human androgen receptor expressed in CV1 cells by transcriptional activation assay
In DepthDetails ArticlePubMed
TargetAndrogen receptor(Homo sapiens (Human))
Ligand Pharmaceuticals
Curated by ChEMBL
LigandPNGBDBM50219537((R)-3-benzyl-4-(2,2,2-trifluoroethyl)-10-(trifluor...)
Affinity DataIC50: >1.00E+4nM. Assay description: Antagonist activity at human androgen receptor expressed in CV1 cells by transcriptional activation assay
In DepthDetails ArticlePubMed