BDBM50219554 (R)-3-phenyl-10-(trifluoromethyl)-3,4-dihydro-2H-[1,4]oxazino[2,3-f]quinolin-8(7H)-one::CHEMBL250083
SMILES FC(F)(F)c1cc(=O)[nH]c2ccc3N[C@@H](COc3c12)c1ccccc1
InChI Key InChIKey=MIWUYMZUVKTOQH-AWEZNQCLSA-N
Data  1 IC50  1 EC50
  Tab Delimited (TSV)   2D SDfile   Computed 3D by Vconf -m prep SDfile
Find this compound or compounds like it in BindingDB:
Activity Spreadsheet -- Enzyme Inhibition Constant Data from BindingDB
Found 2 hits for monomerid = 50219554
TargetAndrogen receptor(Homo sapiens (Human))
Ligand Pharmaceuticals
Curated by ChEMBL
LigandPNGBDBM50219554((R)-3-phenyl-10-(trifluoromethyl)-3,4-dihydro-2H-[...)
Affinity DataEC50: >1.00E+4nM. Assay description: Agonist activity at human androgen receptor expressed in CV1 cells by transcriptional activation assay
In DepthDetails ArticlePubMed
TargetAndrogen receptor(Homo sapiens (Human))
Ligand Pharmaceuticals
Curated by ChEMBL
LigandPNGBDBM50219554((R)-3-phenyl-10-(trifluoromethyl)-3,4-dihydro-2H-[...)
Affinity DataIC50:  1.48E+3nM. Assay description: Antagonist activity at human androgen receptor expressed in CV1 cells by transcriptional activation assay
In DepthDetails ArticlePubMed