BDBM50219564 4-bromo-3-carboxymethoxy-5-(3-methoxycarbonylaminophenyl)thiophene-2-carboxylic acid::CHEMBL243730
SMILES COC(=O)Nc1cccc(c1)-c1sc(C(O)=O)c(OCC(O)=O)c1Br
InChI Key InChIKey=WBABSCZMWNWQAQ-UHFFFAOYSA-N
Data  1 KI
  Tab Delimited (TSV)   2D SDfile   Computed 3D by Vconf -m prep SDfile
Find this compound or compounds like it in BindingDB:
Activity Spreadsheet -- Enzyme Inhibition Constant Data from BindingDB
Found 1 hit for monomerid = 50219564
TargetTyrosine-protein phosphatase non-receptor type 1(Homo sapiens (Human))
Wyeth Research
Curated by ChEMBL
LigandPNGBDBM50219564(4-bromo-3-carboxymethoxy-5-(3-methoxycarbonylamino...)
Affinity DataKi:  2.00E+3nM. Assay description: Inhibition of human recombinant PTP1B
In DepthDetails ArticlePubMed