BDBM50219678 CHEMBL248035::N-(4-(2-fluorophenyl)thiazol-2-yl)-4-(pyrimidin-4-ylamino)benzamide
SMILES Fc1ccccc1-c1csc(NC(=O)c2ccc(Nc3ccncn3)cc2)n1
InChI Key InChIKey=WRNFABFCBYCXMM-UHFFFAOYSA-N
Data  2 EC50
  Tab Delimited (TSV)   2D SDfile   Computed 3D by Vconf -m prep SDfile
Find this compound or compounds like it in BindingDB:
Activity Spreadsheet -- Enzyme Inhibition Constant Data from BindingDB
Found 2 hits for monomerid = 50219678
TargetThrombopoietin receptor(Homo sapiens (Human))
Pfizer
Curated by ChEMBL
LigandPNGBDBM50219678(CHEMBL248035 | N-(4-(2-fluorophenyl)thiazol-2-yl)-...)
Affinity DataEC50:  6.80E+3nM. Assay description: Agonist activity at TPO receptor
In DepthDetails ArticlePubMed
TargetThrombopoietin receptor(Homo sapiens (Human))
Pfizer
Curated by ChEMBL
LigandPNGBDBM50219678(CHEMBL248035 | N-(4-(2-fluorophenyl)thiazol-2-yl)-...)
Affinity DataEC50:  6.85E+3nM. Assay description: Agonist activity at human TPOr expressed in BaF3 cells by reporter assay
In DepthDetails ArticlePubMed