BDBM50219720 CHEMBL32745
SMILES Cc1cc(cc2ccn(C[C@H]3CCCN3S(C)(=O)=O)c12)C(=O)N1CCC(CC1)N1C(=O)OCc2ccccc12
InChI Key InChIKey=AUCCRZPRVDTNFD-RUZDIDTESA-N
Data  1 KI
  Tab Delimited (TSV)   2D SDfile   Computed 3D by Vconf -m prep SDfile
Find this compound or compounds like it in BindingDB:
Activity Spreadsheet -- Enzyme Inhibition Constant Data from BindingDB
Found 1 hit for monomerid = 50219720
TargetOxytocin receptor(Homo sapiens (Human))
Glaxosmithkline
Curated by ChEMBL
LigandPNGBDBM50219720(CHEMBL32745)
Affinity DataKi:  10nM. Assay description: Ability to displace [3H]oxytocin from human OT receptor (hOT)
In DepthDetails ArticlePubMed