BDBM50219733 9-N-ethyl-8-ethoxy-manzamine A::CHEMBL403562
SMILES CCOc1cccc2c3ccnc(C4=C[C@@]5(O)CC\C=C/CCCCN6CCC4[C@]4(C[C@@H]7\C=C/CCCCN7[C@@H]54)C6)c3n(CC)c12
InChI Key InChIKey=ZOZMQOQRAXCUJA-OGIDAHSQSA-N
Data  1 IC50
  Tab Delimited (TSV)   2D SDfile   Computed 3D by Vconf -m prep SDfile
Find this compound or compounds like it in BindingDB:
Activity Spreadsheet -- Enzyme Inhibition Constant Data from BindingDB
Found 1 hit for monomerid = 50219733
TargetGlycogen synthase kinase-3 beta(Homo sapiens (Human))
University Of Mississippi
Curated by ChEMBL
LigandPNGBDBM50219733(9-N-ethyl-8-ethoxy-manzamine A | CHEMBL403562)
Affinity DataIC50:  1.04E+4nM. Assay description: Inhibition of human recombinant GSKbeta
In DepthDetails ArticlePubMed