BDBM50219755 1-cyclohexyl-4-[3-(7-hydroxynaphthalen-1-yl)propyl]piperazine hydrochloride::CHEMBL535634
SMILES Oc1ccc2cccc(CCCN3CCN(CC3)C3CCCCC3)c2c1
InChI Key InChIKey=GZSUKAWVLVTDGA-UHFFFAOYSA-N
Data  2 KI
  Tab Delimited (TSV)   2D SDfile   Computed 3D by Vconf -m prep SDfile
Find this compound or compounds like it in BindingDB:
Activity Spreadsheet -- Enzyme Inhibition Constant Data from BindingDB
Found 2 hits for monomerid = 50219755
TargetSigma non-opioid intracellular receptor 1(Cavia porcellus (Guinea pig))
Universit£
Curated by ChEMBL
LigandPNGBDBM50219755(1-cyclohexyl-4-[3-(7-hydroxynaphthalen-1-yl)propyl...)
Affinity DataKi:  5.48nM. Assay description: Displacement of [3H]pentazocine from Sigma1 receptor in guinea pig brain membrane
In DepthDetails ArticlePubMed
Target3-beta-hydroxysteroid-Delta(8),Delta(7)-isomerase(Cavia porcellus)
Universit£
Curated by ChEMBL
LigandPNGBDBM50219755(1-cyclohexyl-4-[3-(7-hydroxynaphthalen-1-yl)propyl...)
Affinity DataKi:  55nM. Assay description: Displacement of [3H]emopamil from Delta-(8)-Delta-(7) sterol isomerase in guinea pig liver membrane
In DepthDetails ArticlePubMed