BDBM50219765 CHEMBL30550
SMILES FC(F)(F)c1ccc(=O)n(CC(=O)NCc2cc3ccc(cc3o2)C(=O)N2CCC(CC2)N2C(=O)OCc3ccccc23)c1
InChI Key InChIKey=BFOQDPGDCUSZAS-UHFFFAOYSA-N
Data  1 KI
  Tab Delimited (TSV)   2D SDfile   Computed 3D by Vconf -m prep SDfile
Find this compound or compounds like it in BindingDB:
Activity Spreadsheet -- Enzyme Inhibition Constant Data from BindingDB
Found 1 hit for monomerid = 50219765
TargetOxytocin receptor(Homo sapiens (Human))
Glaxosmithkline
Curated by ChEMBL
LigandPNGBDBM50219765(CHEMBL30550)
Affinity DataKi:  100nM. Assay description: Displacement of 3[H]oxytocin from human oxytocin receptor
In DepthDetails ArticlePubMed