BDBM50219937 4-chloro-N-((1r,4r)-4-(2-(4-(3-(trifluoromethyl)phenylamino)piperidin-1-yl)ethyl)cyclohexyl)benzenesulfonamide::CHEMBL393556
SMILES FC(F)(F)c1cccc(NC2CCN(CC[C@H]3CC[C@@H](CC3)NS(=O)(=O)c3ccc(Cl)cc3)CC2)c1
InChI Key InChIKey=OUSKSBFRBAHODU-UILWBTOOSA-N
Data  2 IC50
  Tab Delimited (TSV)   2D SDfile   Computed 3D by Vconf -m prep SDfile
Find this compound or compounds like it in BindingDB:
Activity Spreadsheet -- Enzyme Inhibition Constant Data from BindingDB
Found 2 hits for monomerid = 50219937
TargetD(3) dopamine receptor(Rattus norvegicus (Rat))
Gedeon Richter
Curated by ChEMBL
LigandPNGBDBM50219937(4-chloro-N-((1r,4r)-4-(2-(4-(3-(trifluoromethyl)ph...)
Affinity DataIC50:  3nM. Assay description: Displacement of [3H]spiperone from rat dopamine D3 receptor expressed in Sf9 cells
In DepthDetails ArticlePubMed
TargetD(2) dopamine receptor(Rattus norvegicus (rat))
Gedeon Richter
Curated by ChEMBL
LigandPNGBDBM50219937(4-chloro-N-((1r,4r)-4-(2-(4-(3-(trifluoromethyl)ph...)
Affinity DataIC50:  16nM. Assay description: Displacement of [3H]spiperone from dopamine D2 receptor in rat striatal membranes
In DepthDetails ArticlePubMed