BDBM50219973 CHEMBL291562
SMILES [H][C@]12C[C@@]3([H])CCCC[C@@]3([H])[C@H](C#C[C@H]3CCC[C@H](C)N3C)[C@@]1([H])[C@H](C)OC2=O
InChI Key InChIKey=RQPHVQRRFIQPNU-VOVZHTNUSA-N
Data  4 KI
  Tab Delimited (TSV)   2D SDfile   Computed 3D by Vconf -m prep SDfile
Find this compound or compounds like it in BindingDB:
Activity Spreadsheet -- Enzyme Inhibition Constant Data from BindingDB
Found 4 hits for monomerid = 50219973
TargetMuscarinic acetylcholine receptor M2(Homo sapiens (Human))
Ghent University
Curated by ChEMBL
LigandPNGBDBM50219973(CHEMBL291562)
Affinity DataKi:  1.15E+3nM. Assay description: Binding affinity against human muscarine receptor (hM2) cloned in CHO cells
In DepthDetails ArticlePubMed
TargetMuscarinic acetylcholine receptor M4(Homo sapiens (Human))
Ghent University
Curated by ChEMBL
LigandPNGBDBM50219973(CHEMBL291562)
Affinity DataKi:  1.74E+3nM. Assay description: Binding affinity against human muscarine receptor (hM4) cloned in CHO cells
In DepthDetails ArticlePubMed
TargetMuscarinic acetylcholine receptor M3(Homo sapiens (Human))
Ghent University
Curated by ChEMBL
LigandPNGBDBM50219973(CHEMBL291562)
Affinity DataKi:  5.01E+3nM. Assay description: Binding affinity against human muscarine receptor (hM3) cloned in CHO cells
In DepthDetails ArticlePubMed
TargetMuscarinic acetylcholine receptor M1(Homo sapiens (Human))
Ghent University
Curated by ChEMBL
LigandPNGBDBM50219973(CHEMBL291562)
Affinity DataKi:  5.37E+3nM. Assay description: Binding affinity against human muscarine receptor (hM1) cloned in CHO cells
In DepthDetails ArticlePubMed