BDBM5022 (1R*,3R*,4R*)-3-[(1R*)-1-(Acetylamino)pentyl]-4-{[amino(imino)methyl]amino}cyclopentanecarboxylic Acid::(1R,3R,4R)-3-carbamimidamido-4-[(1R)-1-acetamidopentyl]cyclopentane-1-carboxylic acid::Cyclopentane Derivative 36b
SMILES [H][C@](CCCC)(NC(C)=O)[C@@H]1C[C@H](C[C@H]1N=C(N)N)C(O)=O
InChI Key InChIKey=FOEDJODWGAJPQM-WRWGMCAJSA-N
Data  2 IC50
  Tab Delimited (TSV)   2D SDfile   Computed 3D by Vconf -m prep SDfile
Find this compound or compounds like it in BindingDB:
Activity Spreadsheet -- Enzyme Inhibition Constant Data from BindingDB
Found 2 hits for monomerid = 5022
TargetHemagglutinin(Influenza B virus (B/Victoria/70))
Biocryst Pharmaceuticals
LigandPNGBDBM5022((1R*,3R*,4R*)-3-[(1R*)-1-(Acetylamino)pentyl]-4-{[...)
Affinity DataIC50:  3.00E+5nMpH: 6.5 T: 2°C. Assay description: A standard fluorimetric assay was used to measure influenza virus neuraminidase activity. The substrate 2 -(4-methylumbelliferyl)-alpha-D-acetylneura...
In DepthDetails ArticlePubMed
TargetNeuraminidase(Influenza A virus (A/Singapore/1/57(H2N2)))
Biocryst Pharmaceuticals
LigandPNGBDBM5022((1R*,3R*,4R*)-3-[(1R*)-1-(Acetylamino)pentyl]-4-{[...)
Affinity DataIC50:  1.46E+4nMpH: 6.5 T: 2°C. Assay description: A standard fluorimetric assay was used to measure influenza virus neuraminidase activity. The substrate 2 -(4-methylumbelliferyl)-alpha-D-acetylneura...
In DepthDetails ArticlePubMed